Reaction Details
TargetCarbonic anhydrase 7
LigandBDBM50399077
Substrate/Competitorn/a
Meas. Tech.ChEMBL_878782 (CHEMBL2183722)
Ki 628±n/a nM
Citation Marini, AMMaresca, AAggarwal, MOrlandini, ENencetti, SDa Settimo, FSalerno, SSimorini, FLa Motta, CTaliani, SNuti, EScozzafava, AMcKenna, RRossello, ASupuran, CT Tricyclic sulfonamides incorporating benzothiopyrano[4,3-c]pyrazole and pyridothiopyrano[4,3-c]pyrazole effectively inhibita- andß-carbonic anhydrase: X-ray crystallography and solution investigations on 15 isoforms. J Med Chem55:9619-29 (2012) 
 
Carbonic anhydrase 7
Name:Carbonic anhydrase 7
Type:Enzyme
Mol. Mass.:29664.11
Organism:Homo sapiens (Human)
Description:Human cloned isozyme.
Residue:264
BDBM50399077
NameBDBM50399077
Synonyms:CHEMBL2179306
TypeSmall organic molecule
Emp. Form.C17H12F3N3O2S2
Mol. Mass.411.421
SMILESNS(=O)(=O)c1ccc(cc1)-n1ncc2CSc3cc(ccc3-c12)C(F)(F)F