Reaction Details
TargetCyclin-dependent kinase 5 activator 1
LigandBDBM50399319
Substrate/Competitorn/a
Meas. Tech.ChEMBL_877316 (CHEMBL2188998)
IC50 510±n/a nM
Citation Boulahjar, ROuach, AMatteo, CBourg, SRavache, Mle Guével, RMarionneau, SOullier, TLozach, OMeijer, LGuguen-Guillouzo, CLazar, SAkssira, MTroin, YGuillaumet, GRoutier, S Novel tetrahydropyrido[1,2-a]isoindolone derivatives (valmerins): potent cyclin-dependent kinase/glycogen synthase kinase 3 inhibitors with antiproliferative activities and antitumor effects in human tumor xenografts. J Med Chem55:9589-606 (2012) 
 
Cyclin-dependent kinase 5 activator 1
Name:Cyclin-dependent kinase 5 activator 1
Type:Protein Complex
Mol. Mass.:n/a
Description:n/a
Components:This complex has 2 components.
Component 1
Name:Cyclin-dependent kinase 5
Synonyms:CDK5 CDKN5 Cyclin-dependent kinase 5 (CDK5/ p25) Cyclin-dependent-like kinase 5 PSSALRE Tau protein kinase II catalytic subunit
Type:Enzyme Subunit
Mol. Mass.:33308.61
Organism:Homo sapiens (Human)
Description:n/a
Residue:292
Component 2
Name:Cyclin-dependent kinase 5 activator 1
Synonyms:CD5R1_HUMAN CDK5R1 Cyclin-dependent kinase 5 (CDK5/p25) NCK5A p35
Type:Enzyme Subunit
Mol. Mass.:34077.43
Organism:Homo sapiens (Human)
Description:Q15078
Residue:307
BDBM50399319
NameBDBM50399319
Synonyms:CHEMBL2180870
TypeSmall organic molecule
Emp. Form.C17H19N5O2
Mol. Mass.325.3651
SMILESCn1ccc(NC(=O)Nc2cccc3C(=O)N4CCCCC4c23)n1