Reaction Details
TargetDual specificity tyrosine-phosphorylation-regulated kinase 1A
LigandBDBM50399321
Substrate/Competitorn/a
Meas. Tech.ChEMBL_877314 (CHEMBL2188996)
IC50 2400±n/a nM
Citation Boulahjar, ROuach, AMatteo, CBourg, SRavache, Mle Guével, RMarionneau, SOullier, TLozach, OMeijer, LGuguen-Guillouzo, CLazar, SAkssira, MTroin, YGuillaumet, GRoutier, S Novel tetrahydropyrido[1,2-a]isoindolone derivatives (valmerins): potent cyclin-dependent kinase/glycogen synthase kinase 3 inhibitors with antiproliferative activities and antitumor effects in human tumor xenografts. J Med Chem55:9589-606 (2012) 
 
Dual specificity tyrosine-phosphorylation-regulated kinase 1A
Name:Dual specificity tyrosine-phosphorylation-regulated kinase 1A
Type:Enzyme
Mol. Mass.:85616.61
Organism:Homo sapiens (Human)
Description:Q13627
Residue:763
BDBM50399321
NameBDBM50399321
Synonyms:CHEMBL2180868
TypeSmall organic molecule
Emp. Form.C21H19N5O2S
Mol. Mass.405.473
SMILESO=C(Nc1csc(n1)-c1ccncc1)Nc1cccc2C(=O)N3CCCCC3c12