Reaction Details
TargetGlycogen synthase kinase-3 beta
LigandBDBM50399331
Substrate/Competitorn/a
Meas. Tech.ChEMBL_877494 (CHEMBL2183648)
IC50 9±n/a nM
Citation Ganser, CLauermann, EMaderer, AStauder, TKramb, JPPlutizki, SKindler, TMoehler, MDannhardt, G Novel 3-Azaindolyl-4-arylmaleimides exhibiting potent antiangiogenic efficacy, protein kinase inhibition, and antiproliferative activity. J Med Chem55:9531-40 (2012) 
 
Glycogen synthase kinase-3 beta
Name:Glycogen synthase kinase-3 beta
Type:Enzyme
Mol. Mass.:46756.38
Organism:Homo sapiens (Human)
Description:P49841
Residue:420
BDBM50399331
NameBDBM50399331
Synonyms:CHEMBL2180882 | US9364459, C
TypeSmall organic molecule
Emp. Form.C20H17N3O5
Mol. Mass.379.3661
SMILESCOc1cc(cc(OC)c1OC)C1=C(C(=O)NC1=O)c1c[nH]c2cnccc12