Reaction Details
TargetBreakpoint cluster region protein/Tyrosine-protein kinase ABL1
LigandBDBM50323777
Substrate/Competitorn/a
Meas. Tech.ChEMBL_877760 (CHEMBL2186858)
IC50 1.25±n/a nM
Citation Li, YShen, MZhang, ZLuo, JPan, XLu, XLong, HWen, DZhang, FLeng, FLi, YTu, ZRen, XDing, K Design, synthesis, and biological evaluation of 3-(1H-1,2,3-triazol-1-yl)benzamide derivatives as Potent Pan Bcr-Abl inhibitors including the threonine(315)¿isoleucine(315) mutant. J Med Chem55:10033-46 (2012) 
 
Breakpoint cluster region protein/Tyrosine-protein kinase ABL1
Name:Breakpoint cluster region protein/Tyrosine-protein kinase ABL1
Type:Enzyme
Mol. Mass.:n/a
Description:n/a
Components:This complex has 2 components.
Component 1
Name:Tyrosine-protein kinase ABL1
Synonyms:ABL ABL1_HUMAN JTK7 Proto-oncogene tyrosine-protein kinase ABL1 Tyrosine-protein kinase ABL V-abl Abelson murine leukemia viral oncogene homolog 1 p150 | tyrosine-protein kinase ABL1 isoform a
Type:Enzyme
Mol. Mass.:122897.30
Organism:Homo sapiens (Human)
Description:P00519
Residue:1130
Component 2
Name:Breakpoint cluster region protein
Synonyms:BCR BCR_HUMAN Breakpoint cluster region protein | D22S11
Type:PROTEIN
Mol. Mass.:142824.75
Organism:Homo sapiens (Human)
Description:ChEMBL_305348
Residue:1271
BDBM50323777
NameBDBM50323777
Synonyms:CHEMBL1214141 | N-(4-Methyl-3-(1-methyl-7-(6-methylpyridin-3-ylamino)-2-oxo-1,2-dihydropyrimido[4,5-d]pyrimidin-3(4H)-yl)phenyl)-3-(trifluoromethyl)benzamide
TypeSmall organic molecule
Emp. Form.C28H24F3N7O2
Mol. Mass.547.5311
SMILESCN1C(=O)N(Cc2cnc(Nc3ccc(C)nc3)nc12)c1cc(NC(=O)c2cccc(c2)C(F)(F)F)ccc1C