Reaction Details
TargetPlatelet-derived growth factor receptor beta
LigandBDBM50141809
Substrate/Competitorn/a
Meas. Tech.ChEMBL_878300 (CHEMBL2185928)
IC50 69±n/a nM
Citation Musumeci, FRadi, MBrullo, CSchenone, S Vascular endothelial growth factor (VEGF) receptors: drugs and new inhibitors. J Med Chem55:10797-822 (2012) 
 
Platelet-derived growth factor receptor beta
Name:Platelet-derived growth factor receptor beta
Type:Enzyme
Mol. Mass.:123922.25
Organism:Homo sapiens (Human)
Description:P09619
Residue:1106
BDBM50141809
NameBDBM50141809
Synonyms:2-(2-{4-[4-(4-tert-Butyl-phenylamino)-phenoxy]-6-methoxy-quinolin-7-yloxy}-ethylamino)-ethanol | CHEMBL352308
TypeSmall organic molecule
Emp. Form.C30H35N3O4
Mol. Mass.501.6166
SMILESCOc1cc2c(Oc3ccc(Nc4ccc(cc4)C(C)(C)C)cc3)ccnc2cc1OCCNCCO