Reaction Details
TargetVascular endothelial growth factor receptor 3
LigandBDBM50399537
Substrate/Competitorn/a
Meas. Tech.ChEMBL_878374 (CHEMBL2186467)
IC50 1.1±n/a nM
Citation Musumeci, FRadi, MBrullo, CSchenone, S Vascular endothelial growth factor (VEGF) receptors: drugs and new inhibitors. J Med Chem55:10797-822 (2012) 
 
Vascular endothelial growth factor receptor 3
Name:Vascular endothelial growth factor receptor 3
Type:Protein
Mol. Mass.:152749.58
Organism:Homo sapiens (Human)
Description:P35916-2
Residue:1363
BDBM50399537
NameBDBM50399537
Synonyms:CHEMBL2180604
TypeSmall organic molecule
Emp. Form.C23H23N7O3
Mol. Mass.445.4738
SMILESCc1cc(C(=O)Nc2cc(Oc3ccc4nc(NC(=O)C5CC5)cn4n3)ccc2C)n(C)n1