Reaction Details
TargetVascular endothelial growth factor receptor 1
LigandBDBM50399537
Substrate/Competitorn/a
Meas. Tech.ChEMBL_878376 (CHEMBL2186469)
IC50 3.2±n/a nM
Citation Musumeci, FRadi, MBrullo, CSchenone, S Vascular endothelial growth factor (VEGF) receptors: drugs and new inhibitors. J Med Chem55:10797-822 (2012) 
 
Vascular endothelial growth factor receptor 1
Name:Vascular endothelial growth factor receptor 1
Type:Receptor Tyrosine Kinase
Mol. Mass.:150800.23
Organism:Homo sapiens (Human)
Description:P17948
Residue:1338
BDBM50399537
NameBDBM50399537
Synonyms:CHEMBL2180604
TypeSmall organic molecule
Emp. Form.C23H23N7O3
Mol. Mass.445.4738
SMILESCc1cc(C(=O)Nc2cc(Oc3ccc4nc(NC(=O)C5CC5)cn4n3)ccc2C)n(C)n1