Reaction Details
TargetTyrosine-protein kinase Lck
LigandBDBM50356877
Substrate/Competitorn/a
Meas. Tech.ChEMBL_878367 (CHEMBL2186460)
IC50 22±n/a nM
Citation Musumeci, FRadi, MBrullo, CSchenone, S Vascular endothelial growth factor (VEGF) receptors: drugs and new inhibitors. J Med Chem55:10797-822 (2012) 
 
Tyrosine-protein kinase Lck
Name:Tyrosine-protein kinase Lck
Type:n/a
Mol. Mass.:57987.83
Organism:Homo sapiens (Human)
Description:P06239
Residue:509
BDBM50356877
NameBDBM50356877
Synonyms:CHEMBL1614710
TypeSmall organic molecule
Emp. Form.C22H16F3N3O2S
Mol. Mass.443.442
SMILESFC(F)(F)Oc1ccc(NC(=O)c2sccc2NCc2ccnc3ccccc23)cc1