Reaction Details
TargetVascular endothelial growth factor receptor 3
LigandBDBM50331095
Substrate/Competitorn/a
Meas. Tech.ChEMBL_878374 (CHEMBL2186467)
IC50 0.24±n/a nM
Citation Musumeci, FRadi, MBrullo, CSchenone, S Vascular endothelial growth factor (VEGF) receptors: drugs and new inhibitors. J Med Chem55:10797-822 (2012) 
 
Vascular endothelial growth factor receptor 3
Name:Vascular endothelial growth factor receptor 3
Type:Protein
Mol. Mass.:152749.58
Organism:Homo sapiens (Human)
Description:P35916-2
Residue:1363
BDBM50331095
NameBDBM50331095
Synonyms:CHEMBL1289494 US10464902, Tivozanib
TypeSmall organic molecule
Emp. Form.C22H19ClN4O5
Mol. Mass.454.863
SMILESCOc1cc2nccc(Oc3ccc(NC(=O)Nc4cc(C)on4)c(Cl)c3)c2cc1OC