Reaction Details
Target5-hydroxytryptamine receptor 4
LigandBDBM50399614
Substrate/Competitorn/a
Meas. Tech.ChEMBL_878535 (CHEMBL2188200)
Ki 0.04±n/a nM
Citation Dubost, EDumas, NFossey, CMagnelli, RButt-Gueulle, SBallandonne, CCaignard, DHDulin, FSopkova de-Oliveira Santos, JMillet, PCharnay, YRault, SCailly, TFabis, F Synthesis and structure-affinity relationships of selective high-affinity 5-HT(4) receptor antagonists: application to the design of new potential single photon emission computed tomography tracers. J Med Chem55:9693-707 (2012) 
 
5-hydroxytryptamine receptor 4
Name:5-hydroxytryptamine receptor 4
Type:Enzyme
Mol. Mass.:43767.54
Organism:Homo sapiens (Human)
Description:Q13639
Residue:388
BDBM50399614
NameBDBM50399614
Synonyms:CHEMBL2181170
TypeSmall organic molecule
Emp. Form.C21H24FN3O
Mol. Mass.353.4332
SMILESCCCN1CCC(COc2nc3c(F)cccc3c3ncccc23)CC1