Reaction Details
TargetDiacylglycerol O-acyltransferase 1
LigandBDBM50399680
Substrate/Competitorn/a
Meas. Tech.ChEMBL_876789 (CHEMBL2183606)
IC50 170±n/a nM
Citation Barlind, JGBauer, UABirch, AMBirtles, SBuckett, LKButlin, RJDavies, RDEriksson, JWHammond, CDHovland, RJohannesson, PJohansson, MJKemmitt, PDLindmark, BTMorentin Gutierrez, PNoeske, TANordin, AO'Donnell, CJPetersson, AURedzic, ATurnbull, AVVinblad, J Design and optimization of pyrazinecarboxamide-based inhibitors of diacylglycerol acyltransferase 1 (DGAT1) leading to a clinical candidate dimethylpyrazinecarboxamide phenylcyclohexylacetic acid (AZD7687). J Med Chem55:10610-29 (2012) 
 
Diacylglycerol O-acyltransferase 1
Name:Diacylglycerol O-acyltransferase 1
Type:Protein
Mol. Mass.:55297.82
Organism:Homo sapiens (Human)
Description:O75907
Residue:488
BDBM50399680
NameBDBM50399680
Synonyms:CHEMBL2178948
TypeSmall organic molecule
Emp. Form.C22H25N3O3
Mol. Mass.379.4522
SMILESCc1nc(C)c(nc1C(N)=O)-c1ccc2c(CC[C@]22CC[C@@H](CC2)C(O)=O)c1