Reaction Details
TargetDiacylglycerol O-acyltransferase 1
LigandBDBM50399703
Substrate/Competitorn/a
Meas. Tech.ChEMBL_876789 (CHEMBL2183606)
IC50 410±n/a nM
Citation Barlind, JGBauer, UABirch, AMBirtles, SBuckett, LKButlin, RJDavies, RDEriksson, JWHammond, CDHovland, RJohannesson, PJohansson, MJKemmitt, PDLindmark, BTMorentin Gutierrez, PNoeske, TANordin, AO'Donnell, CJPetersson, AURedzic, ATurnbull, AVVinblad, J Design and optimization of pyrazinecarboxamide-based inhibitors of diacylglycerol acyltransferase 1 (DGAT1) leading to a clinical candidate dimethylpyrazinecarboxamide phenylcyclohexylacetic acid (AZD7687). J Med Chem55:10610-29 (2012) 
 
Diacylglycerol O-acyltransferase 1
Name:Diacylglycerol O-acyltransferase 1
Type:Protein
Mol. Mass.:55297.82
Organism:Homo sapiens (Human)
Description:O75907
Residue:488
BDBM50399703
NameBDBM50399703
Synonyms:CHEMBL2178388
TypeSmall organic molecule
Emp. Form.C21H23F2N3O3
Mol. Mass.403.4224
SMILESCc1nc(C(F)F)c(nc1-c1ccc(cc1)[C@H]1CC[C@H](CC(O)=O)CC1)C(N)=O