Reaction Details
TargetSterol O-acyltransferase 1
LigandBDBM50399707
Substrate/Competitorn/a
Meas. Tech.ChEMBL_876785 (CHEMBL2183602)
IC50 16000±n/a nM
Citation Barlind, JGBauer, UABirch, AMBirtles, SBuckett, LKButlin, RJDavies, RDEriksson, JWHammond, CDHovland, RJohannesson, PJohansson, MJKemmitt, PDLindmark, BTMorentin Gutierrez, PNoeske, TANordin, AO'Donnell, CJPetersson, AURedzic, ATurnbull, AVVinblad, J Design and optimization of pyrazinecarboxamide-based inhibitors of diacylglycerol acyltransferase 1 (DGAT1) leading to a clinical candidate dimethylpyrazinecarboxamide phenylcyclohexylacetic acid (AZD7687). J Med Chem55:10610-29 (2012) 
 
Sterol O-acyltransferase 1
Name:Sterol O-acyltransferase 1
Type:Multi-pass membrane protein may form homo- or heterodimers.
Mol. Mass.:64751.94
Organism:Homo sapiens (Human)
Description:P35610
Residue:550
BDBM50399707
NameBDBM50399707
Synonyms:CHEMBL2178384
TypeSmall organic molecule
Emp. Form.C20H23N3O2S
Mol. Mass.369.481
SMILESCc1ncc(nc1-c1ccc(cc1)[C@H]1CC[C@H](CC(O)=O)CC1)C(N)=S