Reaction Details
TargetDiacylglycerol O-acyltransferase 1
LigandBDBM50399710
Substrate/Competitorn/a
Meas. Tech.ChEMBL_876769 (CHEMBL2183586)
IC50 100±n/a nM
Citation Barlind, JGBauer, UABirch, AMBirtles, SBuckett, LKButlin, RJDavies, RDEriksson, JWHammond, CDHovland, RJohannesson, PJohansson, MJKemmitt, PDLindmark, BTMorentin Gutierrez, PNoeske, TANordin, AO'Donnell, CJPetersson, AURedzic, ATurnbull, AVVinblad, J Design and optimization of pyrazinecarboxamide-based inhibitors of diacylglycerol acyltransferase 1 (DGAT1) leading to a clinical candidate dimethylpyrazinecarboxamide phenylcyclohexylacetic acid (AZD7687). J Med Chem55:10610-29 (2012) 
 
Diacylglycerol O-acyltransferase 1
Name:Diacylglycerol O-acyltransferase 1
Type:Enzyme
Mol. Mass.:56810.61
Organism:Mus musculus (mouse)
Description:In this assay, recombinant mouse DGAT-1 containing an N-terminal His6-epitope tag was produced in the baculovirus expression system.
Residue:498
BDBM50399710
NameBDBM50399710
Synonyms:CHEMBL2178953
TypeSmall organic molecule
Emp. Form.C21H25N3O3
Mol. Mass.367.4415
SMILESCc1nc(C)c(nc1C(N)=O)-c1ccc(cc1)[C@H]1CC[C@H](CC(O)=O)CC1