Reaction Details
TargetDelta-type opioid receptor
LigandBDBM50399882
Substrate/Competitorn/a
Meas. Tech.ChEMBL_877409 (CHEMBL2182839)
Ki>10000±n/a nM
Citation Spetea, MBerzetei-Gurske, IPGuerrieri, ESchmidhammer, H Discovery and pharmacological evaluation of a diphenethylamine derivative (HS665), a highly potent and selective¿ opioid receptor agonist. J Med Chem55:10302-6 (2012) 
 
Delta-type opioid receptor
Name:Delta-type opioid receptor
Type:G Protein-Coupled Receptor (GPCR)
Mol. Mass.:40382.98
Organism:Homo sapiens (Human)
Description:Competition binding assays were carried out using membrane preparations from transfected HN9.10 cells that constitutively expressed the delta opioid receptor.
Residue:372
BDBM50399882
NameBDBM50399882
Synonyms:CHEMBL2180638
TypeSmall organic molecule
Emp. Form.C20H25NO
Mol. Mass.295.4186
SMILESOc1cccc(CCN(CCc2ccccc2)CC2CC2)c1