Reaction Details
TargetDelta-type opioid receptor
LigandBDBM50381677
Substrate/Competitorn/a
Meas. Tech.ChEMBL_877409 (CHEMBL2182839)
Ki>10000±n/a nM
Citation Spetea, MBerzetei-Gurske, IPGuerrieri, ESchmidhammer, H Discovery and pharmacological evaluation of a diphenethylamine derivative (HS665), a highly potent and selective¿ opioid receptor agonist. J Med Chem55:10302-6 (2012) 
 
Delta-type opioid receptor
Name:Delta-type opioid receptor
Type:G Protein-Coupled Receptor (GPCR)
Mol. Mass.:40382.98
Organism:Homo sapiens (Human)
Description:Competition binding assays were carried out using membrane preparations from transfected HN9.10 cells that constitutively expressed the delta opioid receptor.
Residue:372
BDBM50381677
NameBDBM50381677
Synonyms:CHEMBL1256748 | U-69593
TypeSmall organic molecule
Emp. Form.C22H32N2O2
Mol. Mass.356.5017
SMILESCN([C@H]1C[C@@]2(CCCO2)CC[C@@H]1N1CCCC1)C(=O)Cc1ccccc1