Reaction Details
TargetD(2) dopamine receptor
LigandBDBM50399884
Substrate/Competitorn/a
Meas. Tech.ChEMBL_877401 (CHEMBL2182831)
EC50>10000±n/a nM
Citation Spetea, MBerzetei-Gurske, IPGuerrieri, ESchmidhammer, H Discovery and pharmacological evaluation of a diphenethylamine derivative (HS665), a highly potent and selective¿ opioid receptor agonist. J Med Chem55:10302-6 (2012) 
 
D(2) dopamine receptor
Name:D(2) dopamine receptor
Type:Cell-surface receptors
Mol. Mass.:50647.10
Organism:Homo sapiens (Human)
Description:P14416
Residue:443
BDBM50399884
NameBDBM50399884
Synonyms:CHEMBL2180641
TypeSmall organic molecule
Emp. Form.C22H31NO
Mol. Mass.325.4876
SMILESCCCCCCN(CCc1ccccc1)CCc1cccc(O)c1