Reaction Details
TargetD(3) dopamine receptor
LigandBDBM50399881
Substrate/Competitorn/a
Meas. Tech.ChEMBL_877403 (CHEMBL2182833)
Ki 282±n/a nM
Citation Spetea, MBerzetei-Gurske, IPGuerrieri, ESchmidhammer, H Discovery and pharmacological evaluation of a diphenethylamine derivative (HS665), a highly potent and selective¿ opioid receptor agonist. J Med Chem55:10302-6 (2012) 
 
D(3) dopamine receptor
Name:D(3) dopamine receptor
Type:n/a
Mol. Mass.:44243.43
Organism:Homo sapiens (Human)
Description:n/a
Residue:400
BDBM50399881
NameBDBM50399881
Synonyms:CHEMBL2180639
TypeSmall organic molecule
Emp. Form.C21H27NO
Mol. Mass.309.4452
SMILESOc1cccc(CCN(CCc2ccccc2)CC2CCC2)c1