Reaction Details
TargetD(3) dopamine receptor
LigandBDBM50002310
Substrate/Competitorn/a
Meas. Tech.ChEMBL_877403 (CHEMBL2182833)
Ki 22±n/a nM
Citation Spetea, MBerzetei-Gurske, IPGuerrieri, ESchmidhammer, H Discovery and pharmacological evaluation of a diphenethylamine derivative (HS665), a highly potent and selective¿ opioid receptor agonist. J Med Chem55:10302-6 (2012) 
 
D(3) dopamine receptor
Name:D(3) dopamine receptor
Type:n/a
Mol. Mass.:44243.43
Organism:Homo sapiens (Human)
Description:n/a
Residue:400
BDBM50002310
NameBDBM50002310
Synonyms:3-[2-(Phenethyl-propyl-amino)-ethyl]-phenol; hydrobromide CHEMBL545783
TypeSmall organic molecule
Emp. Form.C19H25NO
Mol. Mass.283.4079
SMILESCCCN(CCc1ccccc1)CCc1cccc(O)c1