Reaction Details
TargetD(2) dopamine receptor
LigandBDBM50002310
Substrate/Competitorn/a
Meas. Tech.ChEMBL_877402 (CHEMBL2182832)
Ki 64±n/a nM
Citation Spetea, MBerzetei-Gurske, IPGuerrieri, ESchmidhammer, H Discovery and pharmacological evaluation of a diphenethylamine derivative (HS665), a highly potent and selective¿ opioid receptor agonist. J Med Chem55:10302-6 (2012) 
 
D(2) dopamine receptor
Name:D(2) dopamine receptor
Type:Cell-surface receptors
Mol. Mass.:50647.10
Organism:Homo sapiens (Human)
Description:P14416
Residue:443
BDBM50002310
NameBDBM50002310
Synonyms:3-[2-(Phenethyl-propyl-amino)-ethyl]-phenol; hydrobromide CHEMBL545783
TypeSmall organic molecule
Emp. Form.C19H25NO
Mol. Mass.283.4079
SMILESCCCN(CCc1ccccc1)CCc1cccc(O)c1