Reaction Details
TargetKappa-type opioid receptor
LigandBDBM50399886
Substrate/Competitorn/a
Meas. Tech.ChEMBL_877405 (CHEMBL2182835)
IC50 57±n/a nM
Citation Spetea, MBerzetei-Gurske, IPGuerrieri, ESchmidhammer, H Discovery and pharmacological evaluation of a diphenethylamine derivative (HS665), a highly potent and selective¿ opioid receptor agonist. J Med Chem55:10302-6 (2012) 
 
Kappa-type opioid receptor
Name:Kappa-type opioid receptor
Type:G Protein-Coupled Receptor (GPCR)
Mol. Mass.:42744.99
Organism:Cavia porcellus (domestic guinea pig)
Description:P41144
Residue:380
BDBM50399886
NameBDBM50399886
Synonyms:CHEMBL2180637
TypeSmall organic molecule
Emp. Form.C21H29NO
Mol. Mass.311.4611
SMILESCCCCCN(CCc1ccccc1)CCc1cccc(O)c1