Reaction Details
TargetMu-type opioid receptor
LigandBDBM50399882
Substrate/Competitorn/a
Meas. Tech.ChEMBL_877410 (CHEMBL2182840)
Ki 826±n/a nM
Citation Spetea, MBerzetei-Gurske, IPGuerrieri, ESchmidhammer, H Discovery and pharmacological evaluation of a diphenethylamine derivative (HS665), a highly potent and selective¿ opioid receptor agonist. J Med Chem55:10302-6 (2012) 
 
Mu-type opioid receptor
Name:Mu-type opioid receptor
Type:G Protein-Coupled Receptor (GPCR)
Mol. Mass.:44789.51
Organism:Homo sapiens (Human)
Description:P35372
Residue:400
BDBM50399882
NameBDBM50399882
Synonyms:CHEMBL2180638
TypeSmall organic molecule
Emp. Form.C20H25NO
Mol. Mass.295.4186
SMILESOc1cccc(CCN(CCc2ccccc2)CC2CC2)c1