Reaction Details
TargetMu-type opioid receptor
LigandBDBM50002310
Substrate/Competitorn/a
Meas. Tech.ChEMBL_877410 (CHEMBL2182840)
Ki 594±n/a nM
Citation Spetea, MBerzetei-Gurske, IPGuerrieri, ESchmidhammer, H Discovery and pharmacological evaluation of a diphenethylamine derivative (HS665), a highly potent and selective¿ opioid receptor agonist. J Med Chem55:10302-6 (2012) 
 
Mu-type opioid receptor
Name:Mu-type opioid receptor
Type:G Protein-Coupled Receptor (GPCR)
Mol. Mass.:44789.51
Organism:Homo sapiens (Human)
Description:P35372
Residue:400
BDBM50002310
NameBDBM50002310
Synonyms:3-[2-(Phenethyl-propyl-amino)-ethyl]-phenol; hydrobromide CHEMBL545783
TypeSmall organic molecule
Emp. Form.C19H25NO
Mol. Mass.283.4079
SMILESCCCN(CCc1ccccc1)CCc1cccc(O)c1