Reaction Details
TargetCathepsin E
LigandBDBM50400216
Substrate/Competitorn/a
Meas. Tech.ChEMBL_878949 (CHEMBL2185512)
IC50 52±n/a nM
Citation Liu, YZhang, WLi, LSalvador, LAChen, TChen, WFelsenstein, KMLadd, TBPrice, ARGolde, TEHe, JXu, YLi, YLuesch, H Cyanobacterial peptides as a prototype for the design of potentß-secretase inhibitors and the development of selective chemical probes for other aspartic proteases. J Med Chem55:10749-65 (2012) 
 
Cathepsin E
Name:Cathepsin E
Type:Enzyme
Mol. Mass.:43298.99
Organism:Homo sapiens (Human)
Description:P14091
Residue:396
BDBM50400216
NameBDBM50400216
Synonyms:CHEMBL2181020
TypeSmall organic molecule
Emp. Form.C47H72N8O10
Mol. Mass.909.1222
SMILESCC(C)C[C@H](NC(=O)C[C@H](O)[C@H](Cc1ccccc1)NC(=O)[C@H](CCC(N)=O)N(C)C(=O)[C@@H](NC(=O)[C@H](C)O)C(C)C)C(=O)N[C@@H](C)C(=O)N(C)[C@H](Cc1ccccc1)C(=O)NC(C)C