Reaction Details
TargetReplicative DNA helicase
LigandBDBM50400422
Substrate/Competitorn/a
Meas. Tech.ChEMBL_877478 (CHEMBL2183632)
IC50>100000±n/a nM
Citation Li, BPai, RDi, MAiello, DBarnes, MHButler, MMTashjian, TFPeet, NPBowlin, TLMoir, DT Coumarin-based inhibitors of Bacillus anthracis and Staphylococcus aureus replicative DNA helicase: chemical optimization, biological evaluation, and antibacterial activities. J Med Chem55:10896-908 (2012) 
 
Replicative DNA helicase
Name:Replicative DNA helicase
Type:PROTEIN
Mol. Mass.:50177.37
Organism:Bacillus anthracis
Description:ChEMBL_877478
Residue:453
BDBM50400422
NameBDBM50400422
Synonyms:CHEMBL2178450
TypeSmall organic molecule
Emp. Form.C28H26ClNO4
Mol. Mass.475.963
SMILESCNC(=O)CCc1c(C)c2ccc(OCc3ccc(cc3)-c3ccc(Cl)cc3)c(C)c2oc1=O