Reaction Details
TargetSerine/threonine-protein kinase 33
LigandBDBM50400665
Substrate/Competitorn/a
Meas. Tech.ChEMBL_880288 (CHEMBL2216290)
IC50 110±n/a nM
Citation Weïwer, MSpoonamore, JWei, JGuichard, BRoss, NTMasson, KSilkworth, WDandapani, SPalmer, MScherer, CAStern, AMSchreiber, SLMunoz, B A Potent and Selective Quinoxalinone-Based STK33 Inhibitor Does Not Show Synthetic Lethality in KRAS-Dependent Cells. ACS Med Chem Lett3:1034-1038 (2012) 
 
Serine/threonine-protein kinase 33
Name:Serine/threonine-protein kinase 33
Type:Enzyme Catalytic Domain
Mol. Mass.:57833.21
Organism:Homo sapiens (Human)
Description:gi_23943882
Residue:514
BDBM50400665
NameBDBM50400665
Synonyms:CHEMBL2204238
TypeSmall organic molecule
Emp. Form.C20H12F3N3O3S
Mol. Mass.431.388
SMILESFC(F)(F)Oc1ccc(NC(=O)c2cccs2)c(c1)-c1nc2ccccc2[nH]c1=O