Reaction Details
TargetSerine/threonine-protein kinase 33
LigandBDBM50400669
Substrate/Competitorn/a
Meas. Tech.ChEMBL_880288 (CHEMBL2216290)
IC50 1600±n/a nM
Citation Weïwer, MSpoonamore, JWei, JGuichard, BRoss, NTMasson, KSilkworth, WDandapani, SPalmer, MScherer, CAStern, AMSchreiber, SLMunoz, B A Potent and Selective Quinoxalinone-Based STK33 Inhibitor Does Not Show Synthetic Lethality in KRAS-Dependent Cells. ACS Med Chem Lett3:1034-1038 (2012) 
 
Serine/threonine-protein kinase 33
Name:Serine/threonine-protein kinase 33
Type:Enzyme Catalytic Domain
Mol. Mass.:57833.21
Organism:Homo sapiens (Human)
Description:gi_23943882
Residue:514
BDBM50400669
NameBDBM50400669
Synonyms:CHEMBL2204234
TypeSmall organic molecule
Emp. Form.C21H17N3O2S
Mol. Mass.375.444
SMILESCc1cc2nc(-c3ccccc3NC(=O)c3cccs3)c(=O)[nH]c2cc1C