Reaction Details
TargetSerine/threonine-protein kinase 33
LigandBDBM50400672
Substrate/Competitorn/a
Meas. Tech.ChEMBL_880288 (CHEMBL2216290)
IC50 7300±n/a nM
Citation Weïwer, MSpoonamore, JWei, JGuichard, BRoss, NTMasson, KSilkworth, WDandapani, SPalmer, MScherer, CAStern, AMSchreiber, SLMunoz, B A Potent and Selective Quinoxalinone-Based STK33 Inhibitor Does Not Show Synthetic Lethality in KRAS-Dependent Cells. ACS Med Chem Lett3:1034-1038 (2012) 
 
Serine/threonine-protein kinase 33
Name:Serine/threonine-protein kinase 33
Type:Enzyme Catalytic Domain
Mol. Mass.:57833.21
Organism:Homo sapiens (Human)
Description:gi_23943882
Residue:514
BDBM50400672
NameBDBM50400672
Synonyms:CHEMBL2204231
TypeSmall organic molecule
Emp. Form.C20H15N3O3S
Mol. Mass.377.416
SMILESO=c1[nH]c2ccccc2nc1-c1ccccc1NS(=O)(=O)c1ccccc1