Reaction Details
TargetSerine/threonine-protein kinase 33
LigandBDBM50400678
Substrate/Competitorn/a
Meas. Tech.ChEMBL_880288 (CHEMBL2216290)
IC50>10000±n/a nM
Citation Weïwer, MSpoonamore, JWei, JGuichard, BRoss, NTMasson, KSilkworth, WDandapani, SPalmer, MScherer, CAStern, AMSchreiber, SLMunoz, B A Potent and Selective Quinoxalinone-Based STK33 Inhibitor Does Not Show Synthetic Lethality in KRAS-Dependent Cells. ACS Med Chem Lett3:1034-1038 (2012) 
 
Serine/threonine-protein kinase 33
Name:Serine/threonine-protein kinase 33
Type:Enzyme Catalytic Domain
Mol. Mass.:57833.21
Organism:Homo sapiens (Human)
Description:gi_23943882
Residue:514
BDBM50400678
NameBDBM50400678
Synonyms:CHEMBL2203534
TypeSmall organic molecule
Emp. Form.C19H15N3OS
Mol. Mass.333.407
SMILESO=c1[nH]c2ccccc2nc1-c1ccccc1NCc1cccs1