Reaction Details
TargetSerine/threonine-protein kinase 33
LigandBDBM50400680
Substrate/Competitorn/a
Meas. Tech.ChEMBL_880288 (CHEMBL2216290)
IC50 980±n/a nM
Citation Weïwer, MSpoonamore, JWei, JGuichard, BRoss, NTMasson, KSilkworth, WDandapani, SPalmer, MScherer, CAStern, AMSchreiber, SLMunoz, B A Potent and Selective Quinoxalinone-Based STK33 Inhibitor Does Not Show Synthetic Lethality in KRAS-Dependent Cells. ACS Med Chem Lett3:1034-1038 (2012) 
 
Serine/threonine-protein kinase 33
Name:Serine/threonine-protein kinase 33
Type:Enzyme Catalytic Domain
Mol. Mass.:57833.21
Organism:Homo sapiens (Human)
Description:gi_23943882
Residue:514
BDBM50400680
NameBDBM50400680
Synonyms:CHEMBL2203532
TypeSmall organic molecule
Emp. Form.C22H17N3O3
Mol. Mass.371.3887
SMILESCOc1ccc(cc1)C(=O)Nc1ccccc1-c1nc2ccccc2[nH]c1=O