Reaction Details
TargetPotassium voltage-gated channel subfamily H member 2
LigandBDBM50400788
Substrate/Competitorn/a
Meas. Tech.ChEMBL_879196 (CHEMBL2208509)
Ki 42±n/a nM
Citation Armour, DRde Groot, MJPrice, DAStammen, BLWood, APerros, MBurt, C The discovery of tropane-derived CCR5 receptor antagonists. Chem Biol Drug Des67:305-8 (2006) 
 
Potassium voltage-gated channel subfamily H member 2
Name:Potassium voltage-gated channel subfamily H member 2
Type:Multi-pass membrane protein
Mol. Mass.:126672.65
Organism:Homo sapiens (Human)
Description:Q12809
Residue:1159
BDBM50400788
NameBDBM50400788
Synonyms:CHEMBL2203612
TypeSmall organic molecule
Emp. Form.C29H36N4O2
Mol. Mass.472.6217
SMILESCc1nc2ccccc2n1[C@H]1C[C@@H]2COC[C@H](C1)N2CC[C@H](NC(=O)C1CCC1)c1ccccc1