Reaction Details
TargetMetabotropic glutamate receptor 3
LigandBDBM50401088
Substrate/Competitorn/a
Meas. Tech.ChEMBL_883916 (CHEMBL2213655)
IC50 2500±n/a nM
Citation Sheffler, DJWenthur, CJBruner, JACarrington, SJVinson, PNGogi, KKBlobaum, ALMorrison, RDVamos, MCosford, NDStauffer, SRDaniels, JSNiswender, CMConn, PJLindsley, CW Development of a novel, CNS-penetrant, metabotropic glutamate receptor 3 (mGlu3) NAM probe (ML289) derived from a closely related mGlu5 PAM. Bioorg Med Chem Lett22:3921-5 (2012) 
 
Metabotropic glutamate receptor 3
Name:Metabotropic glutamate receptor 3
Type:Enzyme Catalytic Domain
Mol. Mass.:98889.09
Organism:Homo sapiens (Human)
Description:metabotropic glutamate 1c 0 HUMAN::Q14832
Residue:879
BDBM50401088
NameBDBM50401088
Synonyms:CHEMBL2204439
TypeSmall organic molecule
Emp. Form.C21H21NO3
Mol. Mass.335.3963
SMILESCOc1ccc(cc1)C#Cc1ccc(cc1)C(=O)N1CCCC(O)C1