Reaction Details
TargetProstaglandin D2 receptor 2
LigandBDBM50401118
Substrate/Competitorn/a
Meas. Tech.ChEMBL_884446 (CHEMBL2212208)
IC50 5±n/a nM
Citation Kaila, NHuang, AMoretto, AFollows, BJanz, KLowe, MThomason, JMansour, TSHubeau, CPage, KMorgan, PFish, SXu, XWilliams, CSaiah, E Diazine indole acetic acids as potent, selective, and orally bioavailable antagonists of chemoattractant receptor homologous molecule expressed on Th2 cells (CRTH2) for the treatment of allergic inflammatory diseases. J Med Chem55:5088-109 (2012) 
 
Prostaglandin D2 receptor 2
Name:Prostaglandin D2 receptor 2
Type:Enzyme
Mol. Mass.:43295.45
Organism:Homo sapiens (Human)
Description:Q9Y5Y4
Residue:395
BDBM50401118
NameBDBM50401118
Synonyms:CHEMBL2204472
TypeSmall organic molecule
Emp. Form.C26H26FN3O4
Mol. Mass.463.5007
SMILESCc1c(Cc2ccc(=O)n(Cc3ccc(cc3)C(C)(C)O)n2)c2cc(F)ccc2n1CC(O)=O