Reaction Details
TargetProstaglandin D2 receptor 2
LigandBDBM50401129
Substrate/Competitorn/a
Meas. Tech.ChEMBL_884446 (CHEMBL2212208)
IC50 245±n/a nM
Citation Kaila, NHuang, AMoretto, AFollows, BJanz, KLowe, MThomason, JMansour, TSHubeau, CPage, KMorgan, PFish, SXu, XWilliams, CSaiah, E Diazine indole acetic acids as potent, selective, and orally bioavailable antagonists of chemoattractant receptor homologous molecule expressed on Th2 cells (CRTH2) for the treatment of allergic inflammatory diseases. J Med Chem55:5088-109 (2012) 
 
Prostaglandin D2 receptor 2
Name:Prostaglandin D2 receptor 2
Type:Enzyme
Mol. Mass.:43295.45
Organism:Homo sapiens (Human)
Description:Q9Y5Y4
Residue:395
BDBM50401129
NameBDBM50401129
Synonyms:CHEMBL2204490
TypeSmall organic molecule
Emp. Form.C22H17ClFN3O3
Mol. Mass.425.84
SMILESCc1c(-c2ccc(=O)n(Cc3ccccc3)n2)c2cc(F)cc(Cl)c2n1CC(O)=O