Reaction Details
TargetHeat shock protein HSP 90-alpha
LigandBDBM50401332
Substrate/Competitorn/a
Meas. Tech.ChEMBL_883814 (CHEMBL2212191)
IC50 3.9±n/a nM
Citation Shi, JVan de Water, RHong, KLamer, RBWeichert, KWSandoval, CMKasibhatla, SRBoehm, MFChao, JLundgren, KTimple, NLough, RIbanez, GBoykin, CBurrows, FJKehry, MRYun, TJHarning, EKAmbrose, CThompson, JBixler, SADunah, ASnodgrass-Belt, PArndt, JEnyedy, IJLi, PHong, VSMcKenzie, ABiamonte, MA EC144 is a potent inhibitor of the heat shock protein 90. J Med Chem55:7786-95 (2012) 
 
Heat shock protein HSP 90-alpha
Name:Heat shock protein HSP 90-alpha
Type:Molecular Chaperone
Mol. Mass.:84623.45
Organism:Homo sapiens (Human)
Description:P07900
Residue:732
BDBM50401332
NameBDBM50401332
Synonyms:CHEMBL2205800
TypeSmall organic molecule
Emp. Form.C18H22ClN5O2
Mol. Mass.375.853
SMILESCOc1c(C)cnc(Cn2cc(CCCO)c3c(Cl)nc(N)nc23)c1C