Reaction Details
TargetMetabotropic glutamate receptor 2
LigandBDBM50401391
Substrate/Competitorn/a
Meas. Tech.ChEMBL_881600 (CHEMBL2215923)
EC50 4.1±n/a nM
Citation Andrés, JIAlcázar, JCid, JMDe Angelis, MIturrino, LLanglois, XLavreysen, HTrabanco, AACelen, SBormans, G Synthesis, evaluation, and radiolabeling of new potent positive allosteric modulators of the metabotropic glutamate receptor 2 as potential tracers for positron emission tomography imaging. J Med Chem55:8685-99 (2012) 
 
Metabotropic glutamate receptor 2
Name:Metabotropic glutamate receptor 2
Type:Enzyme
Mol. Mass.:95584.88
Organism:Homo sapiens (Human)
Description:Q14416
Residue:872
BDBM50401391
NameBDBM50401391
Synonyms:CHEMBL2206449
TypeSmall organic molecule
Emp. Form.C23H23F5N4O
Mol. Mass.466.4469
SMILESCOc1c(F)ccc(F)c1C1CCN(CC1)c1ccn2c(CC3CC3)nnc2c1C(F)(F)F