Reaction Details
TargetNeuraminidase
LigandBDBM50401399
Substrate/Competitorn/a
Meas. Tech.ChEMBL_881601 (CHEMBL2215924)
IC50 2.4±n/a nM
Citation Cheng, TJWeinheimer, STarbet, EBJan, JTCheng, YSShie, JJChen, CLChen, CAHsieh, WCHuang, PWLin, WHWang, SYFang, JMHu, OYWong, CH Development of oseltamivir phosphonate congeners as anti-influenza agents. J Med Chem55:8657-70 (2012) 
 
Neuraminidase
Name:Neuraminidase
Type:PROTEIN
Mol. Mass.:49687.56
Organism:Influenza A virus (strain A/Wilson-Smith/1933 H1N1) (Influenza A virus(strain A/WS/1933 H1N1))
Description:ChEMBL_881601
Residue:453
BDBM50401399
NameBDBM50401399
Synonyms:CHEMBL2206456
TypeSmall organic molecule
Emp. Form.C13H25N2O5P
Mol. Mass.320.3218
SMILESCCC(CC)O[C@@H]1C=C(C[C@H](N)[C@H]1NC(C)=O)P(O)(O)=O