Reaction Details
TargetNeuraminidase
LigandBDBM50401400
Substrate/Competitorn/a
Meas. Tech.ChEMBL_881601 (CHEMBL2215924)
IC50 1.1±n/a nM
Citation Cheng, TJWeinheimer, STarbet, EBJan, JTCheng, YSShie, JJChen, CLChen, CAHsieh, WCHuang, PWLin, WHWang, SYFang, JMHu, OYWong, CH Development of oseltamivir phosphonate congeners as anti-influenza agents. J Med Chem55:8657-70 (2012) 
 
Neuraminidase
Name:Neuraminidase
Type:PROTEIN
Mol. Mass.:49687.56
Organism:Influenza A virus (strain A/Wilson-Smith/1933 H1N1) (Influenza A virus(strain A/WS/1933 H1N1))
Description:ChEMBL_881601
Residue:453
BDBM50401400
NameBDBM50401400
Synonyms:CHEMBL2206932
TypeSmall organic molecule
Emp. Form.C16H31N4O5P
Mol. Mass.390.4149
SMILES[#6]-[#6]-[#8]P([#8])(=O)[#6]-1=[#6]-[#6@@H](-[#8]-[#6](-[#6]-[#6])-[#6]-[#6])-[#6@H](-[#7]-[#6](-[#6])=O)-[#6@H](-[#6]-1)\[#7]=[#6](\[#7])-[#7]