Reaction Details
TargetNeuraminidase
LigandBDBM50401401
Substrate/Competitorn/a
Meas. Tech.ChEMBL_882379 (CHEMBL2209784)
IC50 0.35±n/a nM
Citation Cheng, TJWeinheimer, STarbet, EBJan, JTCheng, YSShie, JJChen, CLChen, CAHsieh, WCHuang, PWLin, WHWang, SYFang, JMHu, OYWong, CH Development of oseltamivir phosphonate congeners as anti-influenza agents. J Med Chem55:8657-70 (2012) 
 
Neuraminidase
Name:Neuraminidase
Type:PROTEIN
Mol. Mass.:52146.22
Organism:Influenza A virus (strain A/Udorn/307/1972 H3N2)
Description:ChEMBL_882379
Residue:469
BDBM50401401
NameBDBM50401401
Synonyms:CHEMBL2206459
TypeSmall organic molecule
Emp. Form.C14H27N4O5P
Mol. Mass.362.3617
SMILES[#6]-[#6]-[#6](-[#6]-[#6])-[#8]-[#6@@H]-1-[#6]=[#6](-[#6]-[#6@H](\[#7]=[#6](\[#7])-[#7])-[#6@H]-1-[#7]-[#6](-[#6])=O)P([#8])([#8])=O