Reaction Details
TargetNeuraminidase
LigandBDBM50330326
Substrate/Competitorn/a
Meas. Tech.ChEMBL_882379 (CHEMBL2209784)
IC50 22.9±n/a nM
Citation Cheng, TJWeinheimer, STarbet, EBJan, JTCheng, YSShie, JJChen, CLChen, CAHsieh, WCHuang, PWLin, WHWang, SYFang, JMHu, OYWong, CH Development of oseltamivir phosphonate congeners as anti-influenza agents. J Med Chem55:8657-70 (2012) 
 
Neuraminidase
Name:Neuraminidase
Type:PROTEIN
Mol. Mass.:52146.22
Organism:Influenza A virus (strain A/Udorn/307/1972 H3N2)
Description:ChEMBL_882379
Residue:469
BDBM50330326
NameBDBM50330326
Synonyms:(4S,5R,6R)-5-Acetylamino-4-guanidino-6-((1R,3R)-1,2,3-trihydroxy-propyl)-5,6-dihydro-4H-pyran-2-carboxylic acid (4S,5R,6R)-5-Acetylamino-4-guanidino-6-(1,2,3-trihydroxy-propyl)-5,6-dihydro-4H-pyran-2-carboxylic acid (4S,5R,6R)-5-acetylamino-4-guanidino-6-((1R,2R)-1,2,3-trihydroxy-propy)-5,6-dihydro-4H-pyran-2-carboxylic acid 4-diaminomethylamino-3-methylcarboxamido-2-(1,2,3-trihydroxypropyl)-(3R)-3,4-dihydro-2H-6-pyrancarboxylic acid(Zanamivir) 5-Acetylamino-4-guanidino-6-(1,2,3-trihydroxy-propyl)-5,6-dihydro-4H-pyran-2-carboxylic acid(zanamivir) CHEMBL222813 Relenza | Zanamivi
TypeSmall organic molecule
Emp. Form.C12H20N4O7
Mol. Mass.332.3098
SMILES[#6]-[#6](=O)-[#7]-[#6@@H]-1-[#6@H](-[#6]=[#6](-[#8]-[#6@H]-1-[#6@H](-[#8])-[#6@H](-[#8])-[#6]-[#8])-[#6](-[#8])=O)\[#7]=[#6](\[#7])-[#7]