Reaction Details
TargetC-C chemokine receptor type 4
LigandBDBM50401553
Substrate/Competitorn/a
Meas. Tech.ChEMBL_882640 (CHEMBL2213077)
Ki 630.96±n/a nM
Citation Smethurst, CABevan, NBrooks, CEmmons, AGough, PJMookherjee, CMoores, KPeace, SPhilp, JPiercy, VWatson, SPZippoli, M In vivo activity of an azole series of CCR2 antagonists. Bioorg Med Chem Lett22:7252-5 (2012) 
 
C-C chemokine receptor type 4
Name:C-C chemokine receptor type 4
Type:Enzyme
Mol. Mass.:41406.41
Organism:Homo sapiens (Human)
Description:P51679
Residue:360
BDBM50401553
NameBDBM50401553
Synonyms:CHEMBL2207085
TypeSmall organic molecule
Emp. Form.C15H12Cl3N5O2S
Mol. Mass.432.712
SMILESCn1nnnc1Cc1ccc(Cl)cc1NS(=O)(=O)c1ccc(Cl)c(Cl)c1