Reaction Details
TargetC-C chemokine receptor type 2
LigandBDBM50401550
Substrate/Competitorn/a
Meas. Tech.ChEMBL_882639 (CHEMBL2213076)
Ki 79.43±n/a nM
Citation Smethurst, CABevan, NBrooks, CEmmons, AGough, PJMookherjee, CMoores, KPeace, SPhilp, JPiercy, VWatson, SPZippoli, M In vivo activity of an azole series of CCR2 antagonists. Bioorg Med Chem Lett22:7252-5 (2012) 
 
C-C chemokine receptor type 2
Name:C-C chemokine receptor type 2
Type:Enzyme
Mol. Mass.:41932.32
Organism:Homo sapiens (Human)
Description:P41597
Residue:374
BDBM50401550
NameBDBM50401550
Synonyms:CHEMBL2207084
TypeSmall organic molecule
Emp. Form.C15H12Cl3N5O2S
Mol. Mass.432.712
SMILESCc1nnnn1Cc1ccc(Cl)cc1NS(=O)(=O)c1ccc(Cl)c(Cl)c1