Reaction Details
TargetC-C chemokine receptor type 4
LigandBDBM50401547
Substrate/Competitorn/a
Meas. Tech.ChEMBL_882640 (CHEMBL2213077)
Ki 158.49±n/a nM
Citation Smethurst, CABevan, NBrooks, CEmmons, AGough, PJMookherjee, CMoores, KPeace, SPhilp, JPiercy, VWatson, SPZippoli, M In vivo activity of an azole series of CCR2 antagonists. Bioorg Med Chem Lett22:7252-5 (2012) 
 
C-C chemokine receptor type 4
Name:C-C chemokine receptor type 4
Type:Enzyme
Mol. Mass.:41406.41
Organism:Homo sapiens (Human)
Description:P51679
Residue:360
BDBM50401547
NameBDBM50401547
Synonyms:CHEMBL2207098
TypeSmall organic molecule
Emp. Form.C15H10Cl4N4O2S
Mol. Mass.452.143
SMILESClc1ccc(cc1Cl)S(=O)(=O)Nc1cc(Cl)c(Cl)cc1Cn1ccnn1