Reaction Details
TargetPotassium voltage-gated channel subfamily A member 3
LigandBDBM50279106
Substrate/Competitorn/a
Meas. Tech.ChEMBL_884831 (CHEMBL2216585)
IC50 2±n/a nM
Citation Nguyen, WHoward, BLJenkins, DPWulff, HThompson, PEManallack, DT Structure-activity relationship exploration of Kv1.3 blockers based on diphenoxylate. Bioorg Med Chem Lett22:7106-9 (2012) 
 
Potassium voltage-gated channel subfamily A member 3
Name:Potassium voltage-gated channel subfamily A member 3
Type:PROTEIN
Mol. Mass.:63835.47
Organism:Homo sapiens (Human)
Description:ChEMBL_1513935
Residue:575
BDBM50279106
NameBDBM50279106
Synonyms:4-(4-phenoxybutoxy)-7H-furo[3,2-g]chromen-7-one CHEMBL444449
TypeSmall organic molecule
Emp. Form.C21H18O5
Mol. Mass.350.3646
SMILESO=c1ccc2c(OCCCCOc3ccccc3)c3ccoc3cc2o1