Reaction Details
TargetSodium-dependent dopamine transporter
LigandBDBM50401737
Substrate/Competitorn/a
Meas. Tech.ChEMBL_885012 (CHEMBL2211272)
Ki 25±n/a nM
Citation Pechulis, ADBeck, JPCurry, MAWolf, MAHarms, AEXi, NOpalka, CSweet, MPYang, ZVellekoop, ASKlos, AMCrocker, PJHassler, CLaws, MKitchen, DBSmith, MAOlson, RELiu, SMolino, BF 4-Phenyl tetrahydroisoquinolines as dual norepinephrine and dopamine reuptake inhibitors. Bioorg Med Chem Lett22:7219-22 (2012) 
 
Sodium-dependent dopamine transporter
Name:Sodium-dependent dopamine transporter
Type:Multi-pass membrane protein
Mol. Mass.:68497.11
Organism:Homo sapiens (Human)
Description:Q01959
Residue:620
BDBM50401737
NameBDBM50401737
Synonyms:CHEMBL2206532
TypeSmall organic molecule
Emp. Form.C18H21NO
Mol. Mass.267.3654
SMILESCOc1ccc2C(CN(C)Cc2c1)c1cccc(C)c1