Reaction Details
TargetPeptidyl-glycine alpha-amidating monooxygenase
LigandBDBM50401747
Substrate/Competitorn/a
Meas. Tech.ChEMBL_885020 (CHEMBL2211744)
IC50 370000±n/a nM
Citation Morris, KMCao, FOnagi, HAltamore, TMGamble, ABEaston, CJ Prohormone-substrate peptide sequence recognition by peptidylglycinea-amidating monooxygenase and its reflection in increased glycolate inhibitor potency. Bioorg Med Chem Lett22:7015-8 (2012) 
 
Peptidyl-glycine alpha-amidating monooxygenase
Name:Peptidyl-glycine alpha-amidating monooxygenase
Type:PROTEIN
Mol. Mass.:108328.29
Organism:Homo sapiens (Human)
Description:ChEMBL_885021
Residue:973
BDBM50401747
NameBDBM50401747
Synonyms:CHEMBL2207132
TypeSmall organic molecule
Emp. Form.C14H18N2O5
Mol. Mass.294.3031
SMILESC[C@H](N)C(=O)N[C@@H](Cc1ccccc1)C(=O)OCC(O)=O