Reaction Details
TargetSerine/threonine-protein kinase TBK1
LigandBDBM50401907
Substrate/Competitorn/a
Meas. Tech.ChEMBL_886439 (CHEMBL2213811)
IC50 2±n/a nM
Citation McIver, EGBryans, JBirchall, KChugh, JDrake, TLewis, SJOsborne, JSmiljanic-Hurley, ETsang, WKamal, ALevy, ANewman, MTaylor, DArthur, JSClark, KCohen, P Synthesis and structure-activity relationships of a novel series of pyrimidines as potent inhibitors of TBK1/IKKe kinases. Bioorg Med Chem Lett22:7169-73 (2012) 
 
Serine/threonine-protein kinase TBK1
Name:Serine/threonine-protein kinase TBK1
Type:protein
Mol. Mass.:83645.20
Organism:Homo sapiens (Human)
Description:Q9UHD2
Residue:729
BDBM50401907
NameBDBM50401907
Synonyms:CHEMBL2207181
TypeSmall organic molecule
Emp. Form.C18H21BrFN5O
Mol. Mass.422.295
SMILESFc1cccc(Nc2ncc(Br)c(NCCCNC(=O)C3CCC3)n2)c1