Reaction Details
TargetSerine/threonine-protein kinase TBK1
LigandBDBM50401910
Substrate/Competitorn/a
Meas. Tech.ChEMBL_886439 (CHEMBL2213811)
IC50 6±n/a nM
Citation McIver, EGBryans, JBirchall, KChugh, JDrake, TLewis, SJOsborne, JSmiljanic-Hurley, ETsang, WKamal, ALevy, ANewman, MTaylor, DArthur, JSClark, KCohen, P Synthesis and structure-activity relationships of a novel series of pyrimidines as potent inhibitors of TBK1/IKKe kinases. Bioorg Med Chem Lett22:7169-73 (2012) 
 
Serine/threonine-protein kinase TBK1
Name:Serine/threonine-protein kinase TBK1
Type:protein
Mol. Mass.:83645.20
Organism:Homo sapiens (Human)
Description:Q9UHD2
Residue:729
BDBM50401910
NameBDBM50401910
Synonyms:CHEMBL2207217
TypeSmall organic molecule
Emp. Form.C23H26BrN7O2S
Mol. Mass.544.467
SMILESBrc1cnc(Nc2cccc(NC(=O)N3CCCC3)c2)nc1NCCCNC(=O)c1cccs1