Reaction Details
TargetPancreatic alpha-amylase
LigandBDBM50401975
Substrate/Competitorn/a
Meas. Tech.ChEMBL_886576 (CHEMBL2215736)
IC50 20600±n/a nM
Citation Patil, VSNandre, KPGhosh, SRao, VJChopade, BABhosale, SVBhosale, SV Synthesis and glycosidase inhibitory activity of novel (2-phenyl-4H-benzopyrimedo[2,1-b]-thiazol-4-yliden)acetonitrile derivatives. Bioorg Med Chem Lett22:7011-4 (2012) 
 
Pancreatic alpha-amylase
Name:Pancreatic alpha-amylase
Type:Protein
Mol. Mass.:57088.07
Organism:Sus scrofa (Pig)
Description:P00690
Residue:511
BDBM50401975
NameBDBM50401975
Synonyms:CHEMBL2207951
TypeSmall organic molecule
Emp. Form.C19H12FN3OS
Mol. Mass.349.381
SMILESCOc1ccc2N3C(Sc2c1)=NC(=C\C3=C/C#N)c1ccc(F)cc1